Zn3O3 anion

Gas phase ion energetics data

Data compiled by: John E. Bartmess

Electron affinity of neutral species

EAneutral (eV) Method Reference Comment
1.140 ± 0.020LPESGunaratne, Berkdemir, et al., 2012Vertical Detachment Energy: 1.71±0.02 eV

References

Gunaratne, Berkdemir, et al., 2012
Gunaratne, K.D.D.; Berkdemir, C.; Harmon, C.L.; Castleman, A.W., Investigating the Relative Stabilities and Electronic Properties of Small Zinc Oxide Clusters, J. Phys. Chem. A, 2012, 116, 51, 12429-12437, https://doi.org/10.1021/jp3029374 . [all data]