CH2=C(CF3)CH2 anion
- Formula: C4H4F3-
- Molecular weight: 109.0703

Reaction thermochemistry data

Data compiled by: John E. Bartmess
Individual Reactions
By formula: C4H4F3- + H+ = C4H5F3
Quantity | Value | Units | Method | Reference | Comment |
---|---|---|---|---|---|
ΔrH° | 1565. ± 8.8 | kJ/mol | G+TS | Bartmess and Burnham, 1984 | gas phase; value altered from reference due to change in acidity scale |
Quantity | Value | Units | Method | Reference | Comment |
ΔrG° | 1537. ± 8.4 | kJ/mol | IMRE | Bartmess and Burnham, 1984 | gas phase; value altered from reference due to change in acidity scale |

Gas phase ion energetics data

Data compiled by: John E. Bartmess
Protonation reactions
By formula: C4H4F3- + H+ = C4H5F3
Quantity | Value | Units | Method | Reference | Comment |
---|---|---|---|---|---|
ΔrH° | 1565. ± 8.8 | kJ/mol | G+TS | Bartmess and Burnham, 1984 | gas phase; value altered from reference due to change in acidity scale |
Quantity | Value | Units | Method | Reference | Comment |
ΔrG° | 1537. ± 8.4 | kJ/mol | IMRE | Bartmess and Burnham, 1984 | gas phase; value altered from reference due to change in acidity scale |

References

Bartmess and Burnham, 1984
Bartmess, J.E.; Burnham, R.,
Effect of central substituents on the gas phase acidities of propenes,
J. Org. Chem., 1984, 49, 1382. [all data]