Cd8Se(SePh)16 dianion

Gas phase ion energetics data

Data compiled by: John E. Bartmess

Electron affinity of neutral species

EAneutral (eV) Method Reference Comment
3.010 ± 0.070LPESMatheis, Eichhofer, et al., 2012Vertical Detachment Energy: 3.29±0.07 eV

References

Matheis, Eichhofer, et al., 2012
Matheis, K.; Eichhofer, A.; Weigend, F.; Ehrler, O.T.; Hampe, O.; Kappes, M.M., Probing the Influence of Size and Composition on the Photoelectron Spectra of Cadmium Chalcogenide Cluster Dianions, J. Phys. Chem. C, 2012, 116, 25, 13800-13809, https://doi.org/10.1021/jp303048u . [all data]