CH2=C(CN)CH2 anion
- Formula: C4H4N-
- Molecular weight: 66.0818

Reaction thermochemistry data

Data compiled by: John E. Bartmess
Individual Reactions
By formula: C4H4N- + H+ = C4H5N
Quantity | Value | Units | Method | Reference | Comment |
---|---|---|---|---|---|
ΔrH° | 370.7 ± 2.1 | kcal/mol | G+TS | Bartmess and Burnham, 1984 | gas phase; value altered from reference due to change in acidity scale |
Quantity | Value | Units | Method | Reference | Comment |
ΔrG° | 364.1 ± 2.0 | kcal/mol | IMRE | Bartmess and Burnham, 1984 | gas phase; value altered from reference due to change in acidity scale |

References

Bartmess and Burnham, 1984
Bartmess, J.E.; Burnham, R.,
Effect of central substituents on the gas phase acidities of propenes,
J. Org. Chem., 1984, 49, 1382. [all data]