ScGe19 anion

Gas phase ion energetics data

Data compiled by: John E. Bartmess

Electron affinity of neutral species

EAneutral (eV) Method Reference Comment
3.040 ± 0.050LPESAtobe, Koyasu, et al., 2012

References

Atobe, Koyasu, et al., 2012
Atobe, J.; Koyasu, K.; Furuse, S.; Nakajima, A., Anion photoelectron spectroscopy of germanium and tin clusters containing a transition-or lanthanide-metal atom; MGen- (n=8-20) and MSnn- (n=15-17) (M = Sc-V, Y-Nb, and Lu-Ta), Phys. Chem. Chem. Phys., 2012, 14, 26, 9403-9410, https://doi.org/10.1039/c2cp23247b . [all data]