H2N(CH2CONH)2CH(CONH2)CH2S-[Gly2CysNH2]

Reaction thermochemistry data

Data compiled by: John E. Bartmess

Individual Reactions

C7H13N4O3S + Hydrogen cation = C7H14N4O3S

By formula: C7H13N4O3S + H+ = C7H14N4O3S

Quantity Value Units Method Reference Comment
Δr1400. ± 7.1kJ/molCIDCShen and Ren, 2012gas phase
Quantity Value Units Method Reference Comment
Δr1371. ± 7.1kJ/molCIDCShen and Ren, 2012gas phase

References

Shen and Ren, 2012
Shen, J.L.; Ren, J.H., Gas phase acidity of a cysteine residue in small oligopeptides, Int. J. Mass Spectrom., 2012, 316, 147-156, https://doi.org/10.1016/j.ijms.2012.01.001 . [all data]