3,5-diCF3-C6H3CH2 anion
- Formula: C9H5F6-
- Molecular weight: 227.1270

Reaction thermochemistry data

Data compiled by: John E. Bartmess
Individual Reactions
C9H5F6- + = C9H6F6
By formula: C9H5F6- + H+ = C9H6F6
Quantity | Value | Units | Method | Reference | Comment |
---|---|---|---|---|---|
ΔrH° | 361.0 ± 2.1 | kcal/mol | G+TS | Taft and Topsom, 1987 | gas phase |
Quantity | Value | Units | Method | Reference | Comment |
ΔrG° | 354.3 ± 2.0 | kcal/mol | IMRE | Taft and Topsom, 1987 | gas phase |

Gas phase ion energetics data

Data compiled by: John E. Bartmess
Electron affinity of neutral species
EAneutral (eV) | Method | Reference | Comment |
---|---|---|---|
1.67 ± 0.16 | D-EA | Taft and Topsom, 1987 |
Protonation reactions
C9H5F6- + = C9H6F6
By formula: C9H5F6- + H+ = C9H6F6
Quantity | Value | Units | Method | Reference | Comment |
---|---|---|---|---|---|
ΔrH° | 361.0 ± 2.1 | kcal/mol | G+TS | Taft and Topsom, 1987 | gas phase |
Quantity | Value | Units | Method | Reference | Comment |
ΔrG° | 354.3 ± 2.0 | kcal/mol | IMRE | Taft and Topsom, 1987 | gas phase |

References

Taft and Topsom, 1987
Taft, R.W.; Topsom, R.D.,
The Nature and Analysis of Substituent Effects,
Prog. Phys. Org. Chem., 1987, 16, 1. [all data]