NS anion

Gas phase thermochemistry data

Data compiled by: John E. Bartmess

Quantity Value Units Method Reference Comment
Δfgas150. ± 50.kJ/molR-EABurnett, Feigerle, et al., 1982

References

Burnett, Feigerle, et al., 1982
Burnett, S.M.; Feigerle, C.S.; Stevens, A.E.; Lineberger, C.W., Photoelectron spectroscopy of CS- and NS-, J. Phys. Chem., 1982, 86, 4486. [all data]