H2O..H2NCOCH2CH(NH2)CO2 anion
- Formula: C4H9N2O4-
- Molecular weight: 149.1258

Gas phase thermochemistry data

Data compiled by: John E. Bartmess
Quantity | Value | Units | Method | Reference | Comment |
---|---|---|---|---|---|
ΔfH°gas | -1030. ± 10. | kJ/mol | Ther | Wincel, 2008 |

Ion clustering data

Data compiled by: John E. Bartmess
Clustering reactions
C4H7N2O3- + = C4H9N2O4-
By formula: C4H7N2O3- + H2O = C4H9N2O4-
Quantity | Value | Units | Method | Reference | Comment |
---|---|---|---|---|---|
ΔrH° | 51.5 ± 2.1 | kJ/mol | N/A | Wincel, 2008 | gas phase |
Quantity | Value | Units | Method | Reference | Comment |
ΔrG° | 18. ± 4.6 | kJ/mol | TDAs | Wincel, 2008 | gas phase |

References

Wincel, 2008
Wincel, H.,
Hydration energies of deprotonated amino acids from gas phase equilibria measurements,
J. Am. Soc. Mass Spectrom., 2008, 19, 8, 1091-1097, https://doi.org/10.1016/j.jasms.2008.05.014
. [all data]