H2O..H2N(CH2)4CH(NH2)CO2 anion
- Formula: C6H15N2O3-
- Molecular weight: 163.1954

Reaction thermochemistry data

Data compiled by: John E. Bartmess
Individual Reactions
C6H13N2O2- + = C6H15N2O3-
By formula: C6H13N2O2- + H2O = C6H15N2O3-
Quantity | Value | Units | Method | Reference | Comment |
---|---|---|---|---|---|
ΔrH° | 60.7 ± 2.5 | kJ/mol | N/A | Wincel, 2008 | gas phase |
Quantity | Value | Units | Method | Reference | Comment |
ΔrG° | 30. ± 4.2 | kJ/mol | TDAs | Wincel, 2008 | gas phase |

Ion clustering data

Data compiled by: John E. Bartmess
Clustering reactions
C6H13N2O2- + = C6H15N2O3-
By formula: C6H13N2O2- + H2O = C6H15N2O3-
Quantity | Value | Units | Method | Reference | Comment |
---|---|---|---|---|---|
ΔrH° | 60.7 ± 2.5 | kJ/mol | N/A | Wincel, 2008 | gas phase |
Quantity | Value | Units | Method | Reference | Comment |
ΔrG° | 30. ± 4.2 | kJ/mol | TDAs | Wincel, 2008 | gas phase |

References

Wincel, 2008
Wincel, H.,
Hydration energies of deprotonated amino acids from gas phase equilibria measurements,
J. Am. Soc. Mass Spectrom., 2008, 19, 8, 1091-1097, https://doi.org/10.1016/j.jasms.2008.05.014
. [all data]