H2O..pyrrolidine-2-CO2 anion
- Formula: C5H10NO3-
- Molecular weight: 132.1383

Gas phase thermochemistry data

Data compiled by: John E. Bartmess
Quantity | Value | Units | Method | Reference | Comment |
---|---|---|---|---|---|
ΔfH°gas | -777. ± 14. | kJ/mol | Ther | Wincel, 2008 |

Ion clustering data

Data compiled by: John E. Bartmess
Clustering reactions
C5H8NO2- + = C5H10NO3-
By formula: C5H8NO2- + H2O = C5H10NO3-
Quantity | Value | Units | Method | Reference | Comment |
---|---|---|---|---|---|
ΔrH° | 64.4 ± 2.1 | kJ/mol | N/A | Wincel, 2008 | gas phase |
Quantity | Value | Units | Method | Reference | Comment |
ΔrG° | 31.8 ± 3.8 | kJ/mol | TDAs | Wincel, 2008 | gas phase |

References

Wincel, 2008
Wincel, H.,
Hydration energies of deprotonated amino acids from gas phase equilibria measurements,
J. Am. Soc. Mass Spectrom., 2008, 19, 8, 1091-1097, https://doi.org/10.1016/j.jasms.2008.05.014
. [all data]