pCOPh-C6H4CH2 anion
- Formula: C14H11O-
- Molecular weight: 195.2371

Gas phase ion energetics data

Data compiled by: John E. Bartmess
Protonation reactions
By formula: C14H11O- + H+ = C14H12O
Quantity | Value | Units | Method | Reference | Comment |
---|---|---|---|---|---|
ΔrH° | 360.2 ± 2.1 | kcal/mol | G+TS | Taft and Topsom, 1987 | gas phase; value altered from reference due to change in acidity scale |
Quantity | Value | Units | Method | Reference | Comment |
ΔrG° | 353.5 ± 2.0 | kcal/mol | IMRE | Taft and Topsom, 1987 | gas phase; value altered from reference due to change in acidity scale |

References

Taft and Topsom, 1987
Taft, R.W.; Topsom, R.D.,
The Nature and Analysis of Substituent Effects,
Prog. Phys. Org. Chem., 1987, 16, 1. [all data]