BrO3 anion

Gas phase ion energetics data

Data compiled by: John E. Bartmess

Electron affinity of neutral species

EAneutral (eV) Method Reference Comment
4.600 ± 0.050LPESWen, Hou, et al., 2011at 12K. Vertical Detachment Energy: 2.615±0.05 eV

References

Wen, Hou, et al., 2011
Wen, H.; Hou, G.L.; Huang, W.; Govind, N.; Wang, X.B., Photoelectron spectroscopy of higher bromine and iodine oxide anions: Electron affinities and electronic structures of BrO(2,3) and IO(2-4) radicals, J. Chem. Phys., 2011, 135, 18, 184309, https://doi.org/10.1063/1.3658858 . [all data]