AgOMe anion
- Formula: CH3AgO-
- Molecular weight: 138.9027

Gas phase ion energetics data

Data compiled by: John E. Bartmess
Electron affinity of neutral species
EAneutral (eV) | Method | Reference | Comment |
---|---|---|---|
1.290 ± 0.020 | LPES | Chi, Xie, et al., 2011 | Vertical Detachment Energy: 1.34±0.02 eV |

References

Chi, Xie, et al., 2011
Chi, C.X.; Xie, H.; Cong, R.; Tang, Z.C.; Zhou, M.F.,
Photoelectron Imaging of AgOCH3- and Ag-(CH3OH)(x) (x=1, 2),
Chin. J. Chem. Phys., 2011, 24, 5, 557-562, https://doi.org/10.1088/1674-0068/24/05/557-562
. [all data]