mCF3-C6H4CH2 anion
- Formula: C8H6F3-
- Molecular weight: 159.1290

Gas phase ion energetics data

Data compiled by: John E. Bartmess
Protonation reactions
C8H6F3- + = C8H7F3
By formula: C8H6F3- + H+ = C8H7F3
Quantity | Value | Units | Method | Reference | Comment |
---|---|---|---|---|---|
ΔrH° | 1544. ± 8.8 | kJ/mol | G+TS | Caldwell and Bartmess | gas phase; value altered from reference due to change in acidity scale |
Quantity | Value | Units | Method | Reference | Comment |
ΔrG° | 1515. ± 8.4 | kJ/mol | IMRE | Caldwell and Bartmess | gas phase; value altered from reference due to change in acidity scale |

References

Caldwell and Bartmess
Caldwell, G.; Bartmess, J.E.,
, Unpublished results. [all data]