AlB11 anion

Gas phase ion energetics data

Data compiled by: John E. Bartmess

Electron affinity of neutral species

EAneutral (eV) Method Reference Comment
2.330 ± 0.030LPESRomanescu, Sergeeva, et al., 2011There is also an isomer with EA = 2.16±0.03 eV

References

Romanescu, Sergeeva, et al., 2011
Romanescu, C.; Sergeeva, A.P.; Li, W.L.; Boldyrev, A.I.; Wang, L.S., Planarization of B-7(-) and B-12(-) Clusters by lsoelectronic Substitution: AlB6- and AlB11-, J. Am. Chem. Soc., 2011, 133, 22, 8646-8653, https://doi.org/10.1021/ja2012438 . [all data]