m-benzoquinone radical anion

Gas phase thermochemistry data

Data compiled by: John E. Bartmess

Quantity Value Units Method Reference Comment
Δfgas-250. ± 32.kJ/molAcidFattahi, Kass, et al., 2005

References

Fattahi, Kass, et al., 2005
Fattahi, Alireza; Kass, Steven R.; Liebman, Joel F.; Matos, M. Agostinha R.; Miranda, Margarida S.; Morais, Victor M.F., The Enthalpies of Formation of o -, m -, and p -Benzoquinone: Gas-Phase Ion Energetics, Combustion Calorimetry, and Quantum Chemical Computations Combined, J. Am. Chem. Soc., 2005, 127, 16, 6116-6122, https://doi.org/10.1021/ja042612f . [all data]