GdCl4 anion

Gas phase thermochemistry data

Data compiled by: John E. Bartmess

Quantity Value Units Method Reference Comment
Δfgas-1292. ± 21.kJ/molTherKudin, Vorob'ev, et al., 2007value altered from reference due to conversion from electron convention to ion convention

References

Kudin, Vorob'ev, et al., 2007
Kudin, L.S.; Vorob'ev, D.E.; Grishin, A.E., The Thermochemical Characteristics of the LnCl4- and Ln2Cl7- Negative Ions, Russ. J. Phys. Chem., 2007, 81, 2, 147, https://doi.org/10.1134/S003602440702001X . [all data]