mNO2-C6H4CH2 anion
- Formula: C7H6NO2-
- Molecular weight: 136.1286

Gas phase ion energetics data

Data compiled by: John E. Bartmess
Protonation reactions
By formula: C7H6NO2- + H+ = C7H7NO2
Quantity | Value | Units | Method | Reference | Comment |
---|---|---|---|---|---|
ΔrH° | 362.8 ± 2.1 | kcal/mol | G+TS | Caldwell and Bartmess | gas phase; value altered from reference due to change in acidity scale |
Quantity | Value | Units | Method | Reference | Comment |
ΔrG° | 355.7 ± 2.0 | kcal/mol | IMRE | Caldwell and Bartmess | gas phase; value altered from reference due to change in acidity scale |

References

Caldwell and Bartmess
Caldwell, G.; Bartmess, J.E.,
, Unpublished results. [all data]