mNMe2-C6H4CH2 anion
- Formula: C9H12N-
- Molecular weight: 134.1988

Gas phase ion energetics data

Data compiled by: John E. Bartmess
Protonation reactions
By formula: C9H12N- + H+ = C9H13N
Quantity | Value | Units | Method | Reference | Comment |
---|---|---|---|---|---|
ΔrH° | 1597. ± 21. | kJ/mol | G+TS | Caldwell and Bartmess | gas phase |
Quantity | Value | Units | Method | Reference | Comment |
ΔrG° | 1569. ± 21. | kJ/mol | IMRB | Caldwell and Bartmess | gas phase |

References

Caldwell and Bartmess
Caldwell, G.; Bartmess, J.E.,
, Unpublished results. [all data]