Nb2O7 anion

Gas phase ion energetics data

Data compiled by: John E. Bartmess

Electron affinity of neutral species

EAneutral (eV) Method Reference Comment
5.250 ± 0.050LPESZhai, Zhang, et al., 2011Vertical Detachment Energy: 5.64±0.03 eV

References

Zhai, Zhang, et al., 2011
Zhai, H.J.; Zhang, X.H.; Chen, W.J.; Huang, X.; Wang, L.S., Stoichiometric and Oxygen-Rich M2On-, and M2On (M = Nb, To; n=5-7) Clusters: Molecular Models for Oxygen Radicals, Diradicals, and Superoxides, J. Am. Chem. Soc., 2011, 133, 9, 3085-3094, https://doi.org/10.1021/ja110061v . [all data]