pCl-C6H4CH2 anion

Reaction thermochemistry data

Data compiled by: John E. Bartmess

Individual Reactions

C7H6Cl- + Hydrogen cation = Benzene, 1-chloro-4-methyl-

By formula: C7H6Cl- + H+ = C7H7Cl

Quantity Value Units Method Reference Comment
Δr1565. ± 8.8kJ/molG+TSCaldwell and Bartmessgas phase; value altered from reference due to change in acidity scale
Quantity Value Units Method Reference Comment
Δr1535. ± 8.4kJ/molIMRECaldwell and Bartmessgas phase; value altered from reference due to change in acidity scale

References

Caldwell and Bartmess
Caldwell, G.; Bartmess, J.E., , Unpublished results. [all data]