pNO-C6H4CH2 anion
- Formula: C7H6NO-
- Molecular weight: 120.1292

Reaction thermochemistry data

Data compiled by: John E. Bartmess
Individual Reactions
By formula: C7H6NO- + H+ = C7H7NO
Quantity | Value | Units | Method | Reference | Comment |
---|---|---|---|---|---|
ΔrH° | 351.8 ± 2.1 | kcal/mol | G+TS | Taft and Topsom, 1987 | gas phase; value altered from reference due to change in acidity scale |
Quantity | Value | Units | Method | Reference | Comment |
ΔrG° | 345.1 ± 2.0 | kcal/mol | IMRE | Taft and Topsom, 1987 | gas phase; value altered from reference due to change in acidity scale |

Gas phase ion energetics data

Data compiled by: John E. Bartmess
Protonation reactions
By formula: C7H6NO- + H+ = C7H7NO
Quantity | Value | Units | Method | Reference | Comment |
---|---|---|---|---|---|
ΔrH° | 351.8 ± 2.1 | kcal/mol | G+TS | Taft and Topsom, 1987 | gas phase; value altered from reference due to change in acidity scale |
Quantity | Value | Units | Method | Reference | Comment |
ΔrG° | 345.1 ± 2.0 | kcal/mol | IMRE | Taft and Topsom, 1987 | gas phase; value altered from reference due to change in acidity scale |

References

Taft and Topsom, 1987
Taft, R.W.; Topsom, R.D.,
The Nature and Analysis of Substituent Effects,
Prog. Phys. Org. Chem., 1987, 16, 1. [all data]