(acenaphthene)7 radical anion

Gas phase ion energetics data

Data compiled by: John E. Bartmess

Electron affinity of neutral species

EAneutral (eV) Method Reference Comment
0.420 ± 0.050LPESAndo, Mitsui, et al., 2008Stated electron affinity is the Vertical Detachment Energy

References

Ando, Mitsui, et al., 2008
Ando, N.; Mitsui, M.; Nakajima, A., Photoelectron spectroscopy of cluster anions of naphthalene and related aromatic hydrocarbons, J. Chem. Phys., 2008, 128, 15, 154318, https://doi.org/10.1063/1.2903473 . [all data]