(NH3)2..Pb anion

Gas phase ion energetics data

Data compiled by: John E. Bartmess

Electron affinity of neutral species

EAneutral (eV) Method Reference Comment
0.940 ± 0.050LPESSobhy, Casalenuovo, et al., 2010Vertical Detachment Energy: 1.10±0.05 eV

References

Sobhy, Casalenuovo, et al., 2010
Sobhy, M.A.; Casalenuovo, K.; Reveles, J.U.; Gupta, U.; Khanna, S.N.; Castleman, A.W., Photoelectron Imaging and Density-Functional Investigation of Bismuth and Lead Anions Solvated in Ammonia Clusters, J. Phys. Chem. A, 2010, 114, 42, 11353-11363, https://doi.org/10.1021/jp1058148 . [all data]