pCN-C6H4CH2 anion
- Formula: C8H6N-
- Molecular weight: 116.1405

Reaction thermochemistry data

Data compiled by: John E. Bartmess
Individual Reactions
By formula: C8H6N- + H+ = C8H7N
Quantity | Value | Units | Method | Reference | Comment |
---|---|---|---|---|---|
ΔrH° | 1508. ± 10. | kJ/mol | G+TS | Kahn, Hehre, et al., 1984 | gas phase; value altered from reference due to change in acidity scale |
Quantity | Value | Units | Method | Reference | Comment |
ΔrG° | 1478. ± 9.6 | kJ/mol | IMRE | Kahn, Hehre, et al., 1984 | gas phase; value altered from reference due to change in acidity scale |

Gas phase ion energetics data

Data compiled by: John E. Bartmess
Protonation reactions
By formula: C8H6N- + H+ = C8H7N
Quantity | Value | Units | Method | Reference | Comment |
---|---|---|---|---|---|
ΔrH° | 1508. ± 10. | kJ/mol | G+TS | Kahn, Hehre, et al., 1984 | gas phase; value altered from reference due to change in acidity scale |
Quantity | Value | Units | Method | Reference | Comment |
ΔrG° | 1478. ± 9.6 | kJ/mol | IMRE | Kahn, Hehre, et al., 1984 | gas phase; value altered from reference due to change in acidity scale |

References

Kahn, Hehre, et al., 1984
Kahn, S.D.; Hehre, W.J.; Bartmess, J.E.; Caldwell, G.,
Effect of Metal Complexation on the Gas-phase Acidities of Alkylbenzenes,
Organomet., 1984, 3, 11, 1740, https://doi.org/10.1021/om00089a024
. [all data]