Cr3O8 anion

Gas phase ion energetics data

Data compiled by: John E. Bartmess

Electron affinity of neutral species

EAneutral (eV) Method Reference Comment
4.310 ± 0.030LPESLi, Zhai, et al., 2009Vertical Detachment Energy: 4.44±0.03 eV

References

Li, Zhai, et al., 2009
Li, S.G.; Zhai, H.J.; Wang, L.S.; Dixon, D.A., Structural and Electronic Properties of Reduced Transition Metal Oxide Clusters, M3O8 and M3O8- (M = Cr, W), from Photoelectron Spectroscopy and Quantum Chemical Calculations, J. Phys. Chem. A, 2009, 113, 42, 11273-11288, https://doi.org/10.1021/jp9082008 . [all data]