CoNb8 anion

Gas phase ion energetics data

Data compiled by: John E. Bartmess

Electron affinity of neutral species

EAneutral (eV) Method Reference Comment
1.620 ± 0.050LPESPramann, Koyasu, et al., 2003Vertical Detachment Energy: 2.22±0.05 eV

References

Pramann, Koyasu, et al., 2003
Pramann, A.; Koyasu, K.; Nakajima, A.; Kaya, K., Band gap shiftings in Co-doped Nb-n (n=3-15) clusters: influence of Co 3d electrons on the electronic structure, Int. J. Mass Spectrom., 2003, 229, 1-2, 77-82, https://doi.org/10.1016/S1387-3806(03)00258-6 . [all data]