PhSO2CHMe anion

Reaction thermochemistry data

Data compiled by: John E. Bartmess

Individual Reactions

C8H9O2S- + Hydrogen cation = Benzene, (ethylsulfonyl)-

By formula: C8H9O2S- + H+ = C8H10O2S

Quantity Value Units Method Reference Comment
Δr1527. ± 8.4kJ/molG+TSCumming and Kebarle, 1978gas phase
Quantity Value Units Method Reference Comment
Δr1495. ± 8.4kJ/molIMRECumming and Kebarle, 1978gas phase

References

Cumming and Kebarle, 1978
Cumming, J.B.; Kebarle, P., Summary of gas phase measurements involving acids AH. Entropy changes in proton transfer reactions involving negative ions. Bond dissociation energies D(A-H) and electron affinities EA(A), Can. J. Chem., 1978, 56, 1. [all data]