YbSi6 anion

Gas phase ion energetics data

Data compiled by: John E. Bartmess

Electron affinity of neutral species

EAneutral (eV) Method Reference Comment
1.800 ± 0.050LPESGrubisic, Ko, et al., 2009

References

Grubisic, Ko, et al., 2009
Grubisic, A.; Ko, Y.J.; Wang, H.P.; Bowen, K.H., Photoelectron Spectroscopy of Lanthanide-Silicon Cluster Anions LnSi(n)(-) (3 = n = 13; Ln = Ho, Gd, Pr, Sm, Eu, Yb): Prospect for Magnetic Silicon-Based Clusters, J. Am. Chem. Soc., 2009, 131, 30, 10783-10790, https://doi.org/10.1021/ja805205r . [all data]