tBuCH=NO2 anion
- Formula: C5H10NO2-
- Molecular weight: 116.1389

Reaction thermochemistry data

Data compiled by: John E. Bartmess
Individual Reactions
C5H10NO2- + = C5H11NO2
By formula: C5H10NO2- + H+ = C5H11NO2
Quantity | Value | Units | Method | Reference | Comment |
---|---|---|---|---|---|
ΔrH° | 1486. ± 9.2 | kJ/mol | G+TS | Bartmess, Scott, et al., 1979 | gas phase; value altered from reference due to change in acidity scale |
Quantity | Value | Units | Method | Reference | Comment |
ΔrG° | 1458. ± 8.4 | kJ/mol | IMRE | Bartmess, Scott, et al., 1979 | gas phase; value altered from reference due to change in acidity scale |

Gas phase ion energetics data

Data compiled by: John E. Bartmess

Protonation reactions

C5H10NO2- + Hydrogen cation = C5H11NO2

By formula: C5H10NO2- + H+ = C5H11NO2

Quantity Value Units Method Reference Comment
Δr1486. ± 9.2kJ/molG+TSBartmess, Scott, et al., 1979gas phase; value altered from reference due to change in acidity scale
Quantity Value Units Method Reference Comment
Δr1458. ± 8.4kJ/molIMREBartmess, Scott, et al., 1979gas phase; value altered from reference due to change in acidity scale

References

Bartmess, Scott, et al., 1979
Bartmess, J.E.; Scott, J.A.; McIver, R.T., Jr.,
The gas phase acidity scale from methanol to phenol,
J. Am. Chem. Soc., 1979, 101, 6047. [all data]