mNO2-C6H4CHCN anion
- Formula: C8H5N2O2-
- Molecular weight: 161.1380

Gas phase ion energetics data

Data compiled by: John E. Bartmess
Protonation reactions
By formula: C8H5N2O2- + H+ = C8H6N2O2
Quantity | Value | Units | Method | Reference | Comment |
---|---|---|---|---|---|
ΔrH° | 1412. ± 10. | kJ/mol | G+TS | Taft and Topsom, 1987 | gas phase |
Quantity | Value | Units | Method | Reference | Comment |
ΔrG° | 1384. ± 8.4 | kJ/mol | IMRE | Taft and Topsom, 1987 | gas phase |

Reaction thermochemistry data

Data compiled by: John E. Bartmess
Individual Reactions
By formula: C8H5N2O2- + H+ = C8H6N2O2
Quantity | Value | Units | Method | Reference | Comment |
---|---|---|---|---|---|
ΔrH° | 337.5 ± 2.5 | kcal/mol | G+TS | Taft and Topsom, 1987 | gas phase |
Quantity | Value | Units | Method | Reference | Comment |
ΔrG° | 330.9 ± 2.0 | kcal/mol | IMRE | Taft and Topsom, 1987 | gas phase |

References

Taft and Topsom, 1987
Taft, R.W.; Topsom, R.D.,
The Nature and Analysis of Substituent Effects,
Prog. Phys. Org. Chem., 1987, 16, 1. [all data]