Ge18Cl anion

Gas phase ion energetics data

Data compiled by: John E. Bartmess

Electron affinity of neutral species

EAneutral (eV) Method Reference Comment
3.10 ± 0.10LPESNegishi, Kawamata, et al., 1998

References

Negishi, Kawamata, et al., 1998
Negishi, Y.; Kawamata, H.; Hayakawa, F.; Nakajima, A.; Kaya, K., The infrared HOMO-LUMO gap of germanium clusters, Chem. Phys. Lett., 1998, 294, 4-5, 370-376, https://doi.org/10.1016/S0009-2614(98)00874-4 . [all data]