(COT)3Eu3 anion

Gas phase ion energetics data

Data compiled by: John E. Bartmess

Electron affinity of neutral species

EAneutral (eV) Method Reference Comment
1.10 ± 0.10LPESTakegami, Hosoya, et al., 2005Stated electron affinity is the Vertical Detachment Energy

References

Takegami, Hosoya, et al., 2005
Takegami, R.; Hosoya, N.; Suzumura, J.; Nakajima, A.; Yabushita, S., Geometric and electronic structures of multiple-decker one-end open sandwich clusters: Eu-n(C8H8)(n)(-) (n=1-4), J. Phys. Chem. A, 2005, 109, 11, 2476-2486, https://doi.org/10.1021/jp044806n . [all data]