Al11Cs3 anion

Gas phase ion energetics data

Data compiled by: John E. Bartmess

Electron affinity of neutral species

EAneutral (eV) Method Reference Comment
1.10 ± 0.10LPESKoyasu, Akutsu, et al., 2006

References

Koyasu, Akutsu, et al., 2006
Koyasu, K.; Akutsu, M.; Atobe, J.; Mitsui, M.; Nakajima, A., Electronic properties of Cs-atom doped aluminum and silicon clusters: AlnCsm and SinCsm, Chem. Phys. Lett., 2006, 421, 4-6, 534-539, https://doi.org/10.1016/j.cplett.2006.01.118 . [all data]