pCl-C6H4SO2N(SO2C6F5) anion

Reaction thermochemistry data

Data compiled by: John E. Bartmess

Individual Reactions

C12H4ClF5NO4S2- + Hydrogen cation = C12H5ClF5NO4S2

By formula: C12H4ClF5NO4S2- + H+ = C12H5ClF5NO4S2

Quantity Value Units Method Reference Comment
Δr1238. ± 8.4kJ/molIMRELeito, Raamat, et al., 2009gas phase

References

Leito, Raamat, et al., 2009
Leito, I.; Raamat, E.; Kutt, A.; Saame, J.; Kipper, K.; Koppel, I.A.; Koppel, I.; Zhang, M.; Mishima, M.; Yagupolskii, L.M.; Garlyauskayte, R.Y.; Filatov, A.A., Revision of the Gas-Phase Acidity Scale below 300 kcal mol(-1), J. Phys. Chem. A, 2009, 113, 29, 8421-8424, https://doi.org/10.1021/jp903780k . [all data]