MeCHCN anion

Reaction thermochemistry data

Data compiled by: John E. Bartmess

Individual Reactions

C3H4N- + Hydrogen cation = Propanenitrile

By formula: C3H4N- + H+ = C3H5N

Quantity Value Units Method Reference Comment
Δr1569. ± 8.8kJ/molG+TSBartmess, Scott, et al., 1979gas phase; value altered from reference due to change in acidity scale
Quantity Value Units Method Reference Comment
Δr1537. ± 8.4kJ/molIMREBartmess, Scott, et al., 1979gas phase; value altered from reference due to change in acidity scale

References

Bartmess, Scott, et al., 1979
Bartmess, J.E.; Scott, J.A.; McIver, R.T., Jr., The gas phase acidity scale from methanol to phenol, J. Am. Chem. Soc., 1979, 101, 6047. [all data]