Al29C anion

Gas phase ion energetics data

Data compiled by: John E. Bartmess

Electron affinity of neutral species

EAneutral (eV) Method Reference Comment
2.95 ± 0.10LPESKawamata, Negishi, et al., 2001

References

Kawamata, Negishi, et al., 2001
Kawamata, H.; Negishi, Y.; Nakajima, A.; Kaya, K., Electronic properties of substituted aluminum clusters by boron and carbon atoms (AlnBm-/AlnCm-); new insights into s-p hybridization and perturbed shell structures, Chem. Phys. Lett., 2001, 337, 4-6, 255-262, https://doi.org/10.1016/S0009-2614(01)00198-1 . [all data]