HC(CO2Et)2 anion

Gas phase ion energetics data

Data compiled by: John E. Bartmess

Electron affinity of neutral species

EAneutral (eV) Method Reference Comment
2.61 ± 0.19D-EACumming and Kebarle, 1978

Protonation reactions

C7H11O4- + Hydrogen cation = Diethyl malonate

By formula: C7H11O4- + H+ = C7H12O4

Quantity Value Units Method Reference Comment
Δr1457. ± 9.6kJ/molG+TSCumming and Kebarle, 1978gas phase
Δr1442. ± 5.0kJ/molEIAEMuftakhov, Vasil'ev, et al., 1999gas phase
Quantity Value Units Method Reference Comment
Δr1432. ± 8.4kJ/molIMRECumming and Kebarle, 1978gas phase

References

Cumming and Kebarle, 1978
Cumming, J.B.; Kebarle, P., Summary of gas phase measurements involving acids AH. Entropy changes in proton transfer reactions involving negative ions. Bond dissociation energies D(A-H) and electron affinities EA(A), Can. J. Chem., 1978, 56, 1. [all data]

Muftakhov, Vasil'ev, et al., 1999
Muftakhov, M.V.; Vasil'ev, Y.V.; Mazunov, V.A., Determination of electron affinity of carbonyl radicals by means of negative ion mass spectrometry, Rapid Commun. Mass Spectrom., 1999, 13, 12, 1104-1108, https://doi.org/10.1002/(SICI)1097-0231(19990630)13:12<1104::AID-RCM619>3.0.CO;2-C . [all data]