(COT)2Ce anion

Gas phase ion energetics data

Data compiled by: John E. Bartmess

Electron affinity of neutral species

EAneutral (eV) Method Reference Comment
2.42 ± 0.32LPESKurikawa, Negishi, et al., 1998Vertical Detachment Energy: 2.45±0.10 eV

References

Kurikawa, Negishi, et al., 1998
Kurikawa, T.; Negishi, Y.; Hayakawa, F.; Nagao, S.; Miyajima, K.; Nakajima, A.; Kaya, K., Multiple-decker sandwich complexes of lanthanide-1,3,5,7-cyclooctatetraene [Ln(n)(C8H8)(m)] (Ln = Ce, Nd, Eu, Ho, and Yb); localized ionic bonding structure, J. Am. Chem. Soc., 1998, 120, 45, 11766-11772, https://doi.org/10.1021/ja982438t . [all data]