CH2=C(CN)O anion
- Formula: C3H2NO-
- Molecular weight: 68.0546

Gas phase ion energetics data

Data compiled by: John E. Bartmess
Electron affinity of neutral species
EAneutral (eV) | Method | Reference | Comment |
---|---|---|---|
2.69 ± 0.13 | D-EA | Taft, 1987 | value altered from reference due to change in acidity scale |
Protonation reactions
By formula: C3H2NO- + H+ = C3H3NO
Quantity | Value | Units | Method | Reference | Comment |
---|---|---|---|---|---|
ΔrH° | 344.5 ± 2.1 | kcal/mol | G+TS | Taft, 1987 | gas phase; value altered from reference due to change in acidity scale |
Quantity | Value | Units | Method | Reference | Comment |
ΔrG° | 337.7 ± 2.0 | kcal/mol | IMRE | Taft, 1987 | gas phase; value altered from reference due to change in acidity scale |
ΔrG° | 342.2 ± 5.0 | kcal/mol | IMRB | Brauman and Blair, 1968 | gas phase |

Reaction thermochemistry data

Data compiled by: John E. Bartmess

Individual Reactions

C3H2NO- + Hydrogen cation = Acetyl cyanide

By formula: C3H2NO- + H+ = C3H3NO

Quantity Value Units Method Reference Comment
Δr1441. ± 8.8kJ/molG+TSTaft, 1987gas phase; value altered from reference due to change in acidity scale
Quantity Value Units Method Reference Comment
Δr1413. ± 8.4kJ/molIMRETaft, 1987gas phase; value altered from reference due to change in acidity scale
Δr1432. ± 21.kJ/molIMRBBrauman and Blair, 1968gas phase

References

Taft, 1987
Taft, R.W.,
The Nature and Analysis of Substitutent Electronic Effects,
Personal communication. See also Prog. Phys. Org. Chem., 1987, 16, 1. [all data]
Brauman and Blair, 1968
Brauman, J.I.; Blair, L.K.,
Gas Phase Acidities of Carbon Acids,
J. Am. Chem. Soc., 1968, 90, 20, 5636, https://doi.org/10.1021/ja01022a073
. [all data]