PhCOCH=C(Me)O anion

Reaction thermochemistry data

Data compiled by: John E. Bartmess

Individual Reactions

C10H9O2- + Hydrogen cation = 1,3-Butanedione, 1-phenyl-

By formula: C10H9O2- + H+ = C10H10O2

Quantity Value Units Method Reference Comment
Δr1422. ± 9.6kJ/molG+TSCumming and Kebarle, 1978gas phase
Quantity Value Units Method Reference Comment
Δr1393. ± 8.4kJ/molIMRECumming and Kebarle, 1978gas phase

References

Cumming and Kebarle, 1978
Cumming, J.B.; Kebarle, P., Summary of gas phase measurements involving acids AH. Entropy changes in proton transfer reactions involving negative ions. Bond dissociation energies D(A-H) and electron affinities EA(A), Can. J. Chem., 1978, 56, 1. [all data]