L-Tyrosine anion
- Formula: C9H10NO3-
- Molecular weight: 180.1811
- IUPAC Standard InChIKey: OUYCCCASQSFEME-MRVPVSSYSA-M
- Chemical structure:
View 3d structure (requires JavaScript / HTML 5) - Species with the same structure:

Gas phase ion energetics data

Data compiled by: John E. Bartmess
Electron affinity of neutral species
EAneutral (eV) | Method | Reference | Comment |
---|---|---|---|
2.70 ± 0.10 | LPES | Tian, Wang, et al., 2009 | Vertical Detachment Energy: 2.74±0.10 eV. Actually EA of pOMe-C6H4CH2CH(NH2)CO2-. |

References

Tian, Wang, et al., 2009
Tian, Z.X.; Wang, X.B.; Wang, L.S.; Kass, S.R.,
Are Carboxyl Groups the Most Acidic Sites in Amino Acids? Gas-Phase Acidities, Photoelectron Spectra, and Computations on Tyrosine, p-Hydroxybenzoic Acid, and Their Conjugate Bases,
J. Am. Chem. Soc., 2009, 131, 3, 1174-1181, https://doi.org/10.1021/ja807982k
. [all data]