EtOH..H2NCH2CO2 anion
- Formula: C4H10NO3-
- Molecular weight: 120.1276

Gas phase thermochemistry data

Data compiled by: John E. Bartmess
Quantity | Value | Units | Method | Reference | Comment |
---|---|---|---|---|---|
ΔfH°gas | -801. ± 10. | kJ/mol | Ther | Nieckarz, Atkins, et al., 2008 |

Ion clustering data

Data compiled by: John E. Bartmess
Clustering reactions
C2H4NO2- + = C4H10NO3-
By formula: C2H4NO2- + C2H6O = C4H10NO3-
Quantity | Value | Units | Method | Reference | Comment |
---|---|---|---|---|---|
ΔrH° | 73.5 ± 2.1 | kJ/mol | TDAs | Nieckarz, Atkins, et al., 2008 | gas phase |
Quantity | Value | Units | Method | Reference | Comment |
ΔrG° | 41. ± 4.2 | kJ/mol | TDAs | Nieckarz, Atkins, et al., 2008 | gas phase |

Reaction thermochemistry data

Data compiled by: John E. Bartmess
Individual Reactions
C2H4NO2- + = C4H10NO3-
By formula: C2H4NO2- + C2H6O = C4H10NO3-
Quantity | Value | Units | Method | Reference | Comment |
---|---|---|---|---|---|
ΔrH° | 17.57 ± 0.50 | kcal/mol | TDAs | Nieckarz, Atkins, et al., 2008 | gas phase |
Quantity | Value | Units | Method | Reference | Comment |
ΔrG° | 9.8 ± 1.0 | kcal/mol | TDAs | Nieckarz, Atkins, et al., 2008 | gas phase |

References

Nieckarz, Atkins, et al., 2008
Nieckarz, R.J.; Atkins, C.G.; McMahon, T.B.,
Effects of Isomerization on the Measured Thermochemical Properties of Deprotonated Glycine/Protic-Solvent Clusters,
Chemphyschem, 2008, 9, 18, 2816-2825, https://doi.org/10.1002/cphc.200800525
. [all data]