MeOH..H2NCH2CO2 anion
- Formula: C3H8NO3-
- Molecular weight: 106.1011

Gas phase thermochemistry data

Data compiled by: John E. Bartmess
Quantity | Value | Units | Method | Reference | Comment |
---|---|---|---|---|---|
ΔfH°gas | -182.6 ± 2.5 | kcal/mol | Ther | Nieckarz, Atkins, et al., 2008 |

Reaction thermochemistry data

Data compiled by: John E. Bartmess
Individual Reactions
C2H4NO2- + = C3H8NO3-
By formula: C2H4NO2- + CH4O = C3H8NO3-
Quantity | Value | Units | Method | Reference | Comment |
---|---|---|---|---|---|
ΔrH° | 17.00 ± 0.50 | kcal/mol | TDAs | Nieckarz, Atkins, et al., 2008 | gas phase |
Quantity | Value | Units | Method | Reference | Comment |
ΔrG° | 9.5 ± 1.0 | kcal/mol | TDAs | Nieckarz, Atkins, et al., 2008 | gas phase |

Ion clustering data

Data compiled by: John E. Bartmess

Clustering reactions

C2H4NO2- + Methyl Alcohol = C3H8NO3-

By formula: C2H4NO2- + CH4O = C3H8NO3-

Quantity Value Units Method Reference Comment
Δr17.00 ± 0.50kcal/molTDAsNieckarz, Atkins, et al., 2008gas phase
Quantity Value Units Method Reference Comment
Δr9.5 ± 1.0kcal/molTDAsNieckarz, Atkins, et al., 2008gas phase

References

Nieckarz, Atkins, et al., 2008
Nieckarz, R.J.; Atkins, C.G.; McMahon, T.B.,
Effects of Isomerization on the Measured Thermochemical Properties of Deprotonated Glycine/Protic-Solvent Clusters,
Chemphyschem, 2008, 9, 18, 2816-2825, https://doi.org/10.1002/cphc.200800525
. [all data]