(anthracene)17 radical anion

Gas phase ion energetics data

Data compiled by: John E. Bartmess

Electron affinity of neutral species

EAneutral (eV) Method Reference Comment
1.350 ± 0.020LPESAndo, Mitsui, et al., 2007EA is Vertical Detachment Energy. Second isomer at 1.59±0.02 eV

References

Ando, Mitsui, et al., 2007
Ando, N.; Mitsui, M.; Nakajima, A., Comprehensive photoelectron spectroscopic study of anionic clusters of anthracene and its alkyl derivatives: Electronic structures bridging molecules to bulk, J. Chem. Phys., 2007, 127, 23, 234305, https://doi.org/10.1063/1.2805185 . [all data]