CH2=C(Ph)O anion

Gas phase ion energetics data

Data compiled by: John E. Bartmess

Electron affinity of neutral species

EAneutral (eV) Method Reference Comment
2.064 ± 0.078PDZimmerman, Reed, et al., 1977

Protonation reactions

C8H7O- + Hydrogen cation = Acetophenone

By formula: C8H7O- + H+ = C8H8O

Quantity Value Units Method Reference Comment
Δr1512. ± 8.8kJ/molG+TSBartmess, Scott, et al., 1979gas phase; value altered from reference due to change in acidity scale
Δr1515. ± 11.kJ/molD-EAZimmerman, Reed, et al., 1977gas phase
Δr1516. ± 11.kJ/molG+TSCumming and Kebarle, 1978gas phase
Quantity Value Units Method Reference Comment
Δr1483. ± 8.4kJ/molIMREBartmess, Scott, et al., 1979gas phase; value altered from reference due to change in acidity scale
Δr1487. ± 8.4kJ/molIMRECumming and Kebarle, 1978gas phase

Reaction thermochemistry data

Data compiled by: John E. Bartmess

Individual Reactions

C8H7O- + Hydrogen cation = Acetophenone

By formula: C8H7O- + H+ = C8H8O

Quantity Value Units Method Reference Comment
Δr1512. ± 8.8kJ/molG+TSBartmess, Scott, et al., 1979gas phase; value altered from reference due to change in acidity scale
Δr1515. ± 11.kJ/molD-EAZimmerman, Reed, et al., 1977gas phase
Δr1516. ± 11.kJ/molG+TSCumming and Kebarle, 1978gas phase
Quantity Value Units Method Reference Comment
Δr1483. ± 8.4kJ/molIMREBartmess, Scott, et al., 1979gas phase; value altered from reference due to change in acidity scale
Δr1487. ± 8.4kJ/molIMRECumming and Kebarle, 1978gas phase

References

Zimmerman, Reed, et al., 1977
Zimmerman, A.H.; Reed, K.J.; Brauman, J.I., Photodetachment of electrons from enolate anions. Gas phase electron affinities of enolate radicals, J. Am. Chem. Soc., 1977, 99, 7203. [all data]

Bartmess, Scott, et al., 1979
Bartmess, J.E.; Scott, J.A.; McIver, R.T., Jr., The gas phase acidity scale from methanol to phenol, J. Am. Chem. Soc., 1979, 101, 6047. [all data]

Cumming and Kebarle, 1978
Cumming, J.B.; Kebarle, P., Summary of gas phase measurements involving acids AH. Entropy changes in proton transfer reactions involving negative ions. Bond dissociation energies D(A-H) and electron affinities EA(A), Can. J. Chem., 1978, 56, 1. [all data]