Bi2Ga2 anion

Gas phase ion energetics data

Data compiled by: John E. Bartmess

Electron affinity of neutral species

EAneutral (eV) Method Reference Comment
1.96 ± 0.10LPESSobhy, Reveles, et al., 2009Stated electron affinity is the Vertical Detachment Energy

References

Sobhy, Reveles, et al., 2009
Sobhy, M.A.; Reveles, J.U.; Gupta, U.; Khanna, S.N.; Castleman, A.W., Photoelectron imaging and theoretical investigation of bimetallic Bi1-2Ga0-2- and Pb-1-4(-) cluster anions, J. Chem. Phys., 2009, 130, 5, 054304, https://doi.org/10.1063/1.3069295 . [all data]