Cu@Au17 anion

Gas phase ion energetics data

Data compiled by: John E. Bartmess

Electron affinity of neutral species

EAneutral (eV) Method Reference Comment
3.160 ± 0.060LPESWang., Bulusu, et al., 2007Vertical Detachment Energy: 3.23±0.03 eV

References

Wang., Bulusu, et al., 2007
Wang., L.-M.; Bulusu, S.; Zhai, H.-J.; Zeng, X.-C.; Wang, L.-S., Doping Golden Buckyballs: Cu@Au16- and Cu@Au17- Cluster Anions, Angew. Chem. Int. Ed., 2007, 46, 16, 2915-2918., https://doi.org/10.1002/anie.200700060 . [all data]