Pb2Ag radical anion

Gas phase ion energetics data

Data compiled by: John E. Bartmess

Electron affinity of neutral species

EAneutral (eV) Method Reference Comment
1.68 ± 0.10LPESLiu, Li, et al., 2009Vertical Detachment Energy: 1.85±0.10 eV

References

Liu, Li, et al., 2009
Liu, X.J.; Li, B.; Han, K.L.; Sun, S.T.; Xing, X.P.; Tang, Z.C., Experimental and theoretical studies of complexes of [PbmAg](-) (m=1-4), Phys. Chem. Chem. Phys., 2009, 11, 7, 1043-1049, https://doi.org/10.1039/b812460d . [all data]